{"text_format":"1","workbook":"xlsx","n_sheets":5,"sheets":["Order form","Price List","Languages","LangBackup","Setup"],"not_rendered":{"charts":0,"images":2,"macros":1,"external_links":3,"defined_names":13,"comments":0,"pivot_tables":0},"unopened":[],"bounds":{"document_bytes":16777216,"sheet_cells":100000,"rows_first":2000,"rows_last":500,"rows_between":2000,"halvings":0,"cell_chars":16384,"cell_head_chars":4096},"cells_cut":0,"cells_raw":0,"read":"whole","date_system":"1900"}

{"sheet":"Order form","index":0,"n_rows":73,"n_cols":42,"rows_kept":73,"cut":false,"hidden":false,"merged":[[72,7,72,10],[65,1,70,35],[58,16,58,35],[59,16,59,35],[72,25,72,35],[72,11,72,12],[72,13,72,15],[57,16,57,35],[5,5,5,13],[5,18,5,25],[5,28,5,35],[6,5,6,13],[6,18,6,25],[6,28,6,35],[12,5,12,13],[12,28,12,35],[44,16,44,35],[13,5,13,13],[12,18,12,25],[20,16,20,35],[50,16,50,35],[54,16,54,35],[18,7,18,35],[11,28,11,35],[11,18,11,25],[17,7,17,35],[47,16,47,35],[32,16,32,35],[21,16,21,35],[28,16,28,35],[38,16,38,35],[29,16,29,35],[39,16,39,35],[33,16,33,35],[43,16,43,35],[31,16,31,35],[24,16,24,35],[25,16,25,35],[26,16,26,35],[8,5,8,13],[9,5,9,13],[10,5,10,13],[7,28,7,35],[8,28,8,35],[9,28,9,35],[10,28,10,35],[23,16,23,35],[22,16,22,25],[22,30,22,35],[22,26,22,29],[15,1,15,35],[17,1,17,6],[18,1,18,6],[1,12,1,27],[2,12,2,27],[10,18,10,25],[14,28,14,35],[14,18,14,25],[2,30,2,35],[7,18,7,25],[8,18,8,25],[9,18,9,25],[13,18,13,25],[13,28,13,35],[14,5,14,13],[1,6,1,11],[1,30,1,35],[11,5,11,13],[7,5,7,13],[56,16,56,35],[52,27,52,35],[35,16,35,35],[41,16,41,25],[41,26,41,29],[41,30,41,35],[36,16,36,35],[37,16,37,35],[27,26,27,29],[51,16,51,35],[52,16,52,25],[55,16,55,35],[30,16,30,35],[34,16,34,35],[27,16,27,25],[27,30,27,35]]}
["DELTA20190624EN"]
[100,"Idioma",null,null,null,null,"Español",null,null,null,null,null,"SIGMA",null,null,null,null,null,null,null,null,null,null,null,null,null,null,null,"Fecha",null,{"$f":"TODAY()","v":"2022-08-31"}]
[110,null,null,null,null,null,null,null,null,null,null,null,"FORMULARIO DE PEDIDO",null,null,null,null,null,null,null,null,null,null,null,null,null,null,null,"Versión",null,"Lehner 01"]
[]
[null,null,null,null,null,null,null,null,null,null,null,null,null,null,"Distribuidor: (siempre llene)",null,null,null,null,null,null,null,null,null,null,null,"Dirección de entrega: (siempre completar)"]
[120,"Company:",null,null,null,"Lehner Lifttechnik GmbH",null,null,null,null,null,null,null,null,"Empresa",null,null,null,null,null,null,null,null,null,null,null,"Empresa"]
[130,"Name:",null,null,null,"Max Lehner",null,null,null,null,null,null,null,null,"Name:",null,null,null,null,null,null,null,null,null,null,null,"Name:"]
[140,"Adress:",null,null,null,"Salling 8",null,null,null,null,null,null,null,null,"Dirección",null,null,null,null,null,null,null,null,null,null,null,"Dirección"]
[150,"Postcode:",null,null,null,"A - 4724",null,null,null,null,null,null,null,null,"Código postal",null,null,null,null,null,null,null,null,null,null,null,"Código postal"]
[160,"City:",null,null,null,"Neukirchen am Walde",null,null,null,null,null,null,null,null,"Ciudad",null,null,null,null,null,null,null,null,null,null,null,"Ciudad"]
[170,"Country:",null,null,null,"Austria",null,null,null,null,null,null,null,null,"País",null,null,null,null,null,null,null,null,null,null,null,"País"]
[180,"Phone no:",null,null,null,"+43 7278 3514-0",null,null,null,null,null,null,null,null,"Teléfono",null,null,null,null,null,null,null,null,null,null,null,"Teléfono"]
[190,"E-mail:",null,null,null,"office@lehnerlifttechnik.at",null,null,null,null,null,null,null,null,"Email"]
[200,"ID:",null,null,null,"ATU22360601",null,null,null,null,null,null,null,null,"ID:"]
[210,"VAT ID:",null,null,null,"ATU22360601",null,null,null,null,null,null,null,null,"VAT ID:"]
[220,"Dirección de recogida de los equipos: Spedition Englmayer, Wiesenstrasse 71, 4600 Wels, Austria"]
[]
[null,"Producción no.",null,null,null,null,null,"Nombre de referencia del pedido (o número)"]
[230]
[]
[1000,"Tipo de plataforma",null,null,null,null,null,null,null,null,null,null,null,null,null,null,"Plataforma abierta"]
[1010,"Altura de elevacion exacta (opcional)"]
[null,"Foso (si existe) en mm",null,null,null,null,null,null,null,null,null,null,null,null,null,null,"Sí",null,null,null,null,null,null,null,null,null,{"$f":"IF(ISNUMBER(FIND(\"n\",Q23)),\"\",\"mm:\")","v":"mm:"},null,null,null,null,null,null,null,null,null,null,null,{"$f":"IF(Q23=\"Sí\",\"La altura de elevación se reduce por la profundidad del foso\", \"\")","v":"La altura de elevación se reduce por la profundidad del foso"}]
[null,"Ubicación de la instalación",null,null,null,null,null,null,null,null,null,null,null,null,null,null,"Interior"]
[null,"Rampa de acceso",null,null,null,null,null,null,null,null,null,null,null,null,null,null,"Automático",null,null,null,null,null,null,null,null,null,null,null,null,null,null,null,null,null,null,null,null,null,{"$f":"IF(Q25=\"Ja\",\"The lifting travel is reduced by the pit depth\", \"\")","v":""}]
[null,"Salida lateral en el aterrizaje superior",null,null,null,null,null,null,null,null,null,null,{"$f":"IF(Q25=\"No (standard)\",\"See illustration on the right\", \"\")","v":""},null,null,null,"No (estándar)",null,null,null,null,null,null,null,null,null,null,null,null,null,null,null,null,null,null,null,null,null,{"$f":"IF(Q26<>\"No (estándar)\",\"Vea la ilustración de la derecha\", \"\")","v":""}]
[null,"Entrada lateral en el aterrizaje inferior ",null,null,null,null,null,null,null,null,null,null,null,null,null,null,"No (estándar)",null,null,null,null,null,null,null,null,null,null,null,null,null,null,null,null,null,null,null,null,null,{"$f":"IF(Q27<>\"No (estándar)\",\"Vea la ilustración de la derecha\", \"\")","v":""},"IZQUIERDA - Entrada lateral en el aterrizaje inferior ","DERECHA - Entrada lateral en el aterrizaje inferior "]
[1020,"El color de la superficie",null,null,null,null,null,null,null,null,null,null,null,null,null,null,"RAL 9022 (estándar)",null,null,null,null,null,null,null,null,null,{"$f":"IF(ISNUMBER(FIND(\"Special\",Q28)),\"RAL:\",\"\")","v":""}]
[]
[null,"Specifications",null,null,null,null,null,null,null,null,null,null,null,null,null,null,null,null,null,null,null,null,null,null,null,null,null,null,null,null,null,null,null,null,null,null,null,null,null,"Dirección de apertura de la puerta DIN"]
{"$rows_left_out":44}
{"sheet":"Price List","index":1,"n_rows":60,"n_cols":9,"rows_kept":60,"cut":false,"hidden":true,"merged":[[38,1,42,1],[44,1,47,1],[48,1,55,1],[55,2,55,7],[59,2,59,5],[22,1,32,1],[33,1,37,1],[3,10,3,11],[1,2,1,6],[6,3,6,5],[7,1,10,1],[12,1,21,1]]}
[null,"Price list","SP-DELTA",null,null,null,{"$f":"'Order form'!AE3","v":"Lehner 01"}]
[null,"Order reference name (or number)",{"$f":"'Order form'!H19","v":0}]
[null,"Customer (client):","Lehner Lifttechnik GmbH"]
[null,null,"Salling 8"]
[null,null,"A - 4724"]
[null,null,"Neukirchen am Walde"]
[null,null,"Item",null,null,null,"unit","EUR/unit","Price EUR"]
[null,"Platform price","Basic price for lift with 3m steel rail cut to length",{"$f":"IF(OR(AND('Order form'!Q31=\"Platform + rail cut to length (standard)\",'Order form'!#REF!<>\"aluminium (indoor or outdoor)\")),1,)","v":{"$error":"#REF!"}},null,null,"pc",{"$f":"'[3]Price list'!$C8","v":0},{"$f":"D8*H8","v":{"$error":"#REF!"}}]
[null,null,"Basic price for lift with 3m aluminium rail cut to length",{"$f":"IF(OR(AND('Order form'!Q31=\"Platform + rail cut to length (standard)\",'Order form'!#REF!=\"aluminium (indoor or outdoor)\")),1,)","v":{"$error":"#REF!"}},null,null,"pc",{"$f":"'[3]Price list'!$C9","v":0},{"$f":"D9*H9","v":{"$error":"#REF!"}}]
[null,null,"Surcharge for stainless platform",{"$f":"IF(OR('Order form'!#REF!=\"stainless + Special RAL\"),1,)","v":{"$error":"#REF!"}},null,null,"pc",{"$f":"'[3]Price list'!$C10","v":0},{"$f":"D10*H10","v":{"$error":"#REF!"}}]
[null,null,"Surcharge for zinc sprayed platform",{"$f":"IF(OR('Order form'!#REF!=\"zinc + RAL 7035 (outdoor standard)\",'Order form'!#REF!=\"zinc + Special RAL\"),1,)","v":{"$error":"#REF!"}},null,null,"pc",{"$f":"'[3]Price list'!$C11","v":0},{"$error":"#REF!"}]
[null,"Location","Indoor / Outdoor",null,null,null,null,{"$f":"'[3]Price list'!$C12","v":0}]
[null,"Rail","Steel rail cut to length",{"$f":"IF(AND('Order form'!Q28>3,AND(OR('Order form'!#REF!=\"RAL 9007 (standard indoor)\",'Order form'!#REF!=\"Special RAL\",'Order form'!#REF!=\"stainless 304\",'Order form'!#REF!=\"stainless 316\"))),'Order form'!Q28-3,0)","v":{"$error":"#REF!"}},null,null,"m",{"$f":"'[3]Price list'!$C13","v":0},{"$f":"H13*D13","v":{"$error":"#REF!"}}]
[null,null,"Aluminium stock rail (in 3m pieces)",{"$f":"IF(AND('Order form'!Q28>3,AND('Order form'!#REF!=\"aluminium (indoor or outdoor)\")),'Order form'!Q28-3,0)","v":{"$error":"#REF!"}},null,null,"m",{"$f":"'[3]Price list'!$C14","v":0},{"$f":"H14*D14","v":{"$error":"#REF!"}}]
[null,null,"Stainless rail 304 cut to length",{"$f":"IF(AND('Order form'!Q28>0,'Order form'!#REF!=\"stainless 304\"),'Order form'!Q28,0)","v":{"$error":"#REF!"}},null,null,"m",{"$f":"'[3]Price list'!$C15","v":0},{"$error":"#REF!"}]
[null,null,"Stainless rail 316 cut to length",{"$f":"IF(AND('Order form'!Q28,'Order form'!#REF!=\"stainless 316\"),'Order form'!Q28,0)","v":{"$error":"#REF!"}},null,null,"m",{"$f":"'[3]Price list'!$C16","v":0},{"$error":"#REF!"}]
[null,null,"Color treated pillars (each 0,6 m)",{"$f":"CEILING(E17,1)","v":{"$error":"#REF!"}},{"$f":"IF(OR('Order form'!#REF!=\"on the pillars only\",'Order form'!#REF!=\"on the wall + pillars\"),('Order form'!Q28/0.6+1),0)","v":{"$error":"#REF!"}},null,"pc",{"$f":"'[3]Price list'!$C17","v":0},{"$f":"H17*D17","v":{"$error":"#REF!"}}]
[null,null,"Surcharge - Fire zinc - pillars (each 0,6 m)",{"$f":"IF(OR('Order form'!#REF!=\"zinc + RAL 7035 (outdoor standard)\",'Order form'!#REF!=\"zinc + special RAL\"),D17,0)","v":{"$error":"#REF!"}},null,null,"pc",{"$f":"'[3]Price list'!$C18","v":0},{"$f":"H18*D18","v":{"$error":"#REF!"}}]
[null,null,"Surcharge - Stainless steel pillars (each 0,6 m)",{"$f":"IF(OR('Order form'!#REF!=\"stainless 304\",'Order form'!#REF!=\"stainless 316\"),D17,0)","v":{"$error":"#REF!"}},null,null,"pc",{"$f":"'[3]Price list'!$C19","v":0},{"$f":"H19*D19","v":{"$error":"#REF!"}}]
[null,null,"Extra pillars for controls",{"$f":"IF('Order form'!#REF!=\"Pillar mounted\",'Order form'!Q48,0)","v":{"$error":"#REF!"}},null,null,"pc",{"$f":"'[3]Price list'!$C20","v":0},{"$error":"#REF!"}]
[null,null,"Surcharge - Stainless steel extra pillars for controls",{"$f":"IF(OR('Order form'!#REF!=\"stainless 304\",'Order form'!#REF!=\"stainless 316\"),D20,0)","v":{"$error":"#REF!"}},null,null,"pc",{"$f":"'[3]Price list'!$C21","v":0},{"$error":"#REF!"}]
[null,null,"Adjustable slots on pillars",{"$f":"IF('Order form'!#REF!=\"yes\",D17,0)","v":{"$error":"#REF!"}},null,null,"pc",{"$f":"'[3]Price list'!$C22","v":0},{"$f":"H22*D22","v":{"$error":"#REF!"}}]
[null,"Platform","Automatic folding",{"$f":"IF('Order form'!Q39=\"automatic\",1,0)","v":0},null,null,"pc",{"$f":"'[3]Price list'!$C23","v":0},{"$f":"H23*D23","v":0}]
[null,null,"Non-standard platform dimensions",{"$f":"IF('Order form'!Q36=\"special\",1,0)","v":0},null,null,"pc",{"$f":"'[3]Price list'!$C24","v":0},0]
[null,null,"Platform with front loading ramp",{"$f":"IF(OR('Order form'!Q40=\"Upper and lower ramp + front ramp (90° side access)\",'Order form'!Q40=\"Upper and front (without lower)\"),1,0)","v":0},null,null,"pc",{"$f":"'[3]Price list'!$C25","v":0},{"$f":"H25*D25","v":0}]
[null,null,"Front folding ramp 85o",{"$f":"IF('Order form'!Q41=\"yes\",1,0)","v":0},null,null,"pc",{"$f":"'[3]Price list'!$C26","v":0},{"$f":"H26*D26","v":0}]
[null,null,"Platform without lower loading ramp",{"$f":"IF('Order form'!Q40=\"Upper and front ramp (without lower)\",1,0)","v":0},null,null,"pc",{"$f":"'[3]Price list'!$C27","v":0},{"$f":"H27*D27","v":0}]
[null,null,"Folding sideboard",{"$f":"IF('Order form'!Q44=\"yes\",1,0)","v":0},null,null,"pc",{"$f":"'[3]Price list'!$C28","v":0},0]
[null,null,"The length of loading ramps 300mm",{"$f":"IF('Order form'!Q42=\"300mm (special)\",1,0)","v":0},null,null,"pc",{"$f":"'[3]Price list'!$C29","v":0},0]
[null,null,"Plastic cover",{"$f":"IF('Order form'!Q58=\"yes\",1,0)","v":0},null,null,"pc",{"$f":"'[3]Price list'!$C30","v":0},{"$f":"H30*D30","v":0}]
{"$rows_left_out":31}
{"sheet":"Languages","index":2,"n_rows":171,"n_cols":10,"rows_kept":171,"cut":false,"hidden":true,"merged":[]}
["Cell","Type","English","Deutsch","Français","Español"]
[{"$f":"CELL(\"address\",'Order form'!M2)","v":"'[SIGMA order form_2022_FR.xlsm]Order form'!$M$2"},"Label","SIGMA","SIGMA","SIGMA","SIGMA"]
[{"$f":"CELL(\"address\",'Order form'!M3)","v":"'[SIGMA order form_2022_FR.xlsm]Order form'!$M$3"},"Label","ORDER FORM","BESTELLFORMULAR","BON DE COMMANDE","FORMULARIO DE PEDIDO"]
[{"$f":"CELL(\"address\",'Order form'!AC2)","v":"'[SIGMA order form_2022_FR.xlsm]Order form'!$AC$2"},"Label","Date","Datum","Date","Fecha"]
[{"$f":"CELL(\"address\",'Order form'!B2)","v":"'[SIGMA order form_2022_FR.xlsm]Order form'!$B$2"},"Label","Language","Sprache","La langue","Idioma"]
[{"$f":"CELL(\"address\",'Order form'!AC3)","v":"'[SIGMA order form_2022_FR.xlsm]Order form'!$AC$3"},"Label","Version","Version","Version","Versión"]
[{"$f":"CELL(\"address\",'Order form'!O5)","v":"'[SIGMA order form_2022_FR.xlsm]Order form'!$O$5"},"Label","Distributor: (always fill out)","Händler: (immer ausfüllen)","Distributeur:","Distribuidor: (siempre llene)"]
[{"$f":"CELL(\"address\",'Order form'!AA5)","v":"'[SIGMA order form_2022_FR.xlsm]Order form'!$AA$5"},"Label","Delivery address: (always fill out)","Lieferadresse: (immer ausfüllen)","Adresse de livraison:","Dirección de entrega: (siempre completar)"]
[{"$f":"CELL(\"address\",'Order form'!O6)","v":"'[SIGMA order form_2022_FR.xlsm]Order form'!$O$6"},"Label","Company","Firma","Société","Empresa"]
[{"$f":"CELL(\"address\",'Order form'!AA6)","v":"'[SIGMA order form_2022_FR.xlsm]Order form'!$AA$6"},"Label","Company","Firma","Société","Empresa"]
[{"$f":"CELL(\"address\",'Order form'!O8)","v":"'[SIGMA order form_2022_FR.xlsm]Order form'!$O$8"},"Label","Address","Anschrift","Adresse","Dirección"]
[{"$f":"CELL(\"address\",'Order form'!AA8)","v":"'[SIGMA order form_2022_FR.xlsm]Order form'!$AA$8"},"Label","Address","Anschrift","Adresse","Dirección"]
[{"$f":"CELL(\"address\",'Order form'!O9)","v":"'[SIGMA order form_2022_FR.xlsm]Order form'!$O$9"},"Label","Postcode","PLZ","Code postal","Código postal"]
[{"$f":"CELL(\"address\",'Order form'!AA9)","v":"'[SIGMA order form_2022_FR.xlsm]Order form'!$AA$9"},"Label","Postcode","PLZ","Code postal","Código postal"]
[{"$f":"CELL(\"address\",'Order form'!O10)","v":"'[SIGMA order form_2022_FR.xlsm]Order form'!$O$10"},"Label","City","Stadt","Ville","Ciudad"]
[{"$f":"CELL(\"address\",'Order form'!AA10)","v":"'[SIGMA order form_2022_FR.xlsm]Order form'!$AA$10"},"Label","City","Stadt","Ville","Ciudad"]
[{"$f":"CELL(\"address\",'Order form'!O11)","v":"'[SIGMA order form_2022_FR.xlsm]Order form'!$O$11"},"Label","Country","Land","Le pays","País"]
[{"$f":"CELL(\"address\",'Order form'!AA11)","v":"'[SIGMA order form_2022_FR.xlsm]Order form'!$AA$11"},"Label","Country","Land","Le pays","País"]
[{"$f":"CELL(\"address\",'Order form'!O12)","v":"'[SIGMA order form_2022_FR.xlsm]Order form'!$O$12"},"Label","Telephone","Telefon","Téléphone","Teléfono"]
[{"$f":"CELL(\"address\",'Order form'!AA12)","v":"'[SIGMA order form_2022_FR.xlsm]Order form'!$AA$12"},"Label","Telephone","Telefon","Téléphone","Teléfono"]
[{"$f":"CELL(\"address\",'Order form'!B16)","v":"'[SIGMA order form_2022_FR.xlsm]Order form'!$B$16"},"Label","Pick up address for lifts: Spedition Englmayer, Wiesenstrasse 71, 4600 Wels, Austria","ABHOLADRESSE: Spedition Englmayer, Wiesenstrasse 71, 4600 Wels, Austria","Adresse de l'entrepôt: Spedition Englmayer, Wiesenstrasse 71, 4600 Wels, Austria","Dirección de recogida de los equipos: Spedition Englmayer, Wiesenstrasse 71, 4600 Wels, Austria"]
[{"$f":"CELL(\"address\",'Order form'!B18)","v":"'[SIGMA order form_2022_FR.xlsm]Order form'!$B$18"},"Label","Production no.","Produktionsnr.","Num. de production","Producción no."]
[{"$f":"CELL(\"address\",'Order form'!H18)","v":"'[SIGMA order form_2022_FR.xlsm]Order form'!$H$18"},"Label","Order reference name (or number)","Auftragsreferenz (Name oder Nummer)","Nom de référence de la commande (ou numéro)","Nombre de referencia del pedido (o número)"]
[]
[null,null,null,null,null,null,"Left","Links","La gauche","Izquierda"]
[null,null,null,null,null,null,"Right","Rechts","Droite","Derecha"]
[]
[]
[{"$f":"CELL(\"address\",'Order form'!B21)","v":"'[SIGMA order form_2022_FR.xlsm]Order form'!$B$21"},"Label","Type of platform lift","Type of platform lift","Type de plate-forme élévatrice","Tipo de plataforma"]
[{"$f":"CELL(\"address\",'Order form'!B22)","v":"'[SIGMA order form_2022_FR.xlsm]Order form'!$B$22"},"Label","Lifting height exact (optional)","Hubhöhe exakt (optional)","Hauteur de levage exacte","Altura de elevacion exacta (opcional)"]
{"$rows_left_out":142}
{"sheet":"LangBackup","index":3,"n_rows":164,"n_cols":5,"rows_kept":164,"cut":false,"hidden":true,"merged":[]}
["Cell","Type","English","Deutsch","French"]
["Q3","Label","ALPHA stairlift","Alpha Treppenlift"]
["Q4","Label","Order form","Bestellformular","Bon de commande"]
["D3","Label","Dimension No.","Abmessung Nr.","Numéro de dimension"]
["D5","Label","Language","Sprache","La langue"]
["AD3","Label","Date:","Datum:","l' date"]
["AD4","Label","Version:","Version:","Version"]
["P6","Label","Distributor: (always fill out)","Händler: (immer ausfüllen)","Distributeur: (remplissez toujours)"]
["AB6","Label","Delivery address: (always fill out)","Lieferadresse: (immer ausfüllen)","Adresse de livraison: (remplissez toujours)"]
["P7","Label","Company:","Firma:","Enterprise"]
["B7","Label","Company:","Firma:","Enterprise"]
["P9","Label","Address","Anschrift","Une robe"]
["AB9","Label","Address","Anschrift","Une robe"]
["P10","Label","Postcode","Postleitzahl","Code postal"]
["AB10","Label","Postcode","Postleitzahl","Code postal"]
["P11","Label","City","Stadt","Ville"]
["AB11","Label","City","Stadt","Ville"]
["P12","Label","Country","Land","le pays"]
["AB12","Label","Country","Land","le pays"]
["D23","Label","Installation location","Installationsort"]
["D24","Label","Installation side","Montageseite","Côté d'installation"]
["C17","Label","Pick up address for lifts: Spedition Englmayer, Wiesenstrasse 71, 4600 Wels, Austria","ABHOLADRESSE: Spedition Englmayer, Wiesenstrasse 71, 4600 Wels, Austria"]
["C19","Label","Production No.","Produktionsnummer"]
["I19","Label","Order reference name (or number)","Auftragsreferenz (Name oder Nummer)"]
["C22","Label","Rail specification","Schienenspezifikation"]
["D25","Label","Rail length in meters rounded","Schienenlänge (ungefähr in m)","Longueur du rail en mètres arrondis"]
["D26","Label","Lower stop","Untere Haltestelle","Arrêt inférieur"]
["D27","Label","Upper stop","Obere Haltestelle","Arrêt supérieur"]
["D28","Label","Number of 90° curves","Anzahl der 90° Kurven","Nombre de courbes à 90°"]
["D28","Label","Number of 180° curves","Anzahl der 180° Kurven","Nombre de courbes à 180°"]
{"$rows_left_out":135}
{"sheet":"Setup","index":4,"n_rows":1,"n_cols":2,"rows_kept":1,"cut":false,"hidden":true,"merged":[]}
["Language","Español"]